BDBM50167430 CHEMBL3799871
SMILES N[C@@H](Cc1ccc(cc1)C(=O)\N=C(/N)NCc1ccc(Cl)cc1N1CCCCC1)C(O)=O
InChI Key InChIKey=HLQVTHMKHLAPQN-IBGZPJMESA-N
Data  1 IC50
  Tab Delimited (TSV)   2D SDfile   Computed 3D by Vconf -m prep SDfile
Find this compound or compounds like it in BindingDB:
Activity Spreadsheet -- Enzyme Inhibition Constant Data from BindingDB
Found 1 hit for monomerid = 50167430
TargetTryptophan 5-hydroxylase 1(Homo sapiens (Human))
Karos Pharmaceuticals
Curated by ChEMBL
LigandPNGBDBM50167430(CHEMBL3799871)
Affinity DataIC50:  74nM. Assay description: Inhibition of TPH1 (unknown origin)
In DepthDetails ArticlePubMed