BDBM50167431 CHEMBL3797367
SMILES Cc1ccc(CN\C(N)=N\C(=O)c2ccc(C[C@H](N)C(O)=O)cc2)c(c1)N1CCCCC1
InChI Key InChIKey=VCYIRXKAYSWWPF-FQEVSTJZSA-N
Data  1 IC50
  Tab Delimited (TSV)   2D SDfile   Computed 3D by Vconf -m prep SDfile
Find this compound or compounds like it in BindingDB:
Activity Spreadsheet -- Enzyme Inhibition Constant Data from BindingDB
Found 1 hit for monomerid = 50167431
TargetTryptophan 5-hydroxylase 1(Homo sapiens (Human))
Karos Pharmaceuticals
Curated by ChEMBL
LigandPNGBDBM50167431(CHEMBL3797367)
Affinity DataIC50:  69nM. Assay description: Inhibition of TPH1 (unknown origin)
In DepthDetails ArticlePubMed