BDBM50167549 1-(4-Benzyloxy-phenyl)-3-[1-(2-pyrrolidin-1-yl-ethyl)-1H-indazol-6-yl]-urea::CHEMBL372570
SMILES O=C(Nc1ccc(OCc2ccccc2)cc1)Nc1ccc2cnn(CCN3CCCC3)c2c1
InChI Key InChIKey=MKWZMWRFPPUXEB-UHFFFAOYSA-N
Data  1 IC50
  Tab Delimited (TSV)   2D SDfile   Computed 3D by Vconf -m prep SDfile
Find this compound or compounds like it in BindingDB:
Activity Spreadsheet -- Enzyme Inhibition Constant Data from BindingDB
Found 1 hit for monomerid = 50167549
TargetMelanin-concentrating hormone receptor 1(Mus musculus)
Abbott Laboratories
Curated by ChEMBL
LigandPNGBDBM50167549(1-(4-Benzyloxy-phenyl)-3-[1-(2-pyrrolidin-1-yl-eth...)
Affinity DataIC50:  113nM. Assay description: Inhibitory concentration against mouse Melanin-concentrating hormone receptor 1 expressed in IMR-32 cells using [125I]-MCH
In DepthDetails ArticlePubMed