BDBM50167564 1-{1-[2-((S)-2-Methoxymethyl-pyrrolidin-1-yl)-ethyl]-1H-indazol-5-yl}-3-(4-phenoxy-phenyl)-urea::CHEMBL364071
SMILES COC[C@@H]1CCCN1CCn1ncc2cc(NC(=O)Nc3ccc(Oc4ccccc4)cc3)ccc12
InChI Key InChIKey=XQPIUMZQPPLXSB-DEOSSOPVSA-N
Data  1 IC50
  Tab Delimited (TSV)   2D SDfile   Computed 3D by Vconf -m prep SDfile
Find this compound or compounds like it in BindingDB:
Activity Spreadsheet -- Enzyme Inhibition Constant Data from BindingDB
Found 1 hit for monomerid = 50167564
TargetMelanin-concentrating hormone receptor 1(Mus musculus)
Abbott Laboratories
Curated by ChEMBL
LigandPNGBDBM50167564(1-{1-[2-((S)-2-Methoxymethyl-pyrrolidin-1-yl)-ethy...)
Affinity DataIC50:  38.7nM. Assay description: Inhibitory concentration against mouse Melanin-concentrating hormone receptor 1 expressed in IMR-32 cells using [125I]-MCH
In DepthDetails ArticlePubMed