BDBM50167807 1-(4-fluorophenyl)-4a-methyl-4'-vinyl-(4'S,4aS,5'R)-spiro[1,4,4a,5,6,7-hexahydrocyclopenta[f]indazole-5,2'-(dihydro[1,3]dioxolane)]::CHEMBL194059
SMILES C[C@]12Cc3cnn(c3C=C1CC[C@]21OC[C@@H](O1)C=C)-c1ccc(F)cc1
InChI Key InChIKey=PBYIXRTVEABHKD-SESVDKBCSA-N
Data  1 IC50
  Tab Delimited (TSV)   2D SDfile   Computed 3D by Vconf -m prep SDfile
Find this compound or compounds like it in BindingDB:
Activity Spreadsheet -- Enzyme Inhibition Constant Data from BindingDB
Found 1 hit for monomerid = 50167807
TargetGlucocorticoid receptor(Homo sapiens (Human))
Merck Research Laboratories
Curated by ChEMBL
LigandPNGBDBM50167807(1-(4-fluorophenyl)-4a-methyl-4'-vinyl-(4'S,4aS,5'R...)
Affinity DataIC50:  5.60nM. Assay description: Inhibition of human glucocorticoid receptor alpha isoform
In DepthDetails ArticlePubMed