BDBM50168278 (S)-3-Amino-4-((S)-2-cyano-pyrrolidin-1-yl)-N-(1-methoxymethyl-2-phenyl-ethyl)-4-oxo-butyramide::CHEMBL192733
SMILES COCC(Cc1ccccc1)NC(=O)C[C@H](N)C(=O)N1CCC[C@H]1C#N
InChI Key InChIKey=UYKJQCWPHLLARX-BSOSBYQFSA-N
Data  2 IC50
  Tab Delimited (TSV)   2D SDfile   Computed 3D by Vconf -m prep SDfile
Find this compound or compounds like it in BindingDB:
Activity Spreadsheet -- Enzyme Inhibition Constant Data from BindingDB
Found 2 hits for monomerid = 50168278
TargetDipeptidyl peptidase 4(Homo sapiens (Human))
National Health Research Institutes
Curated by ChEMBL
LigandPNGBDBM50168278((S)-3-Amino-4-((S)-2-cyano-pyrrolidin-1-yl)-N-(1-m...)
Affinity DataIC50:  182nM. Assay description: Inhibitory concentration against Dipeptidyl-peptidase IV [DPP-IV]
In DepthDetails ArticlePubMed
TargetDipeptidyl peptidase 8(Homo sapiens (Human))
National Health Research Institutes
Curated by ChEMBL
LigandPNGBDBM50168278((S)-3-Amino-4-((S)-2-cyano-pyrrolidin-1-yl)-N-(1-m...)
Affinity DataIC50:  2.11E+3nM. Assay description: Inhibitory concentration against Dipeptidyl-peptidase 8
In DepthDetails ArticlePubMed