BDBM50168279 (S)-3-Amino-4-((S)-2-cyano-pyrrolidin-1-yl)-N-[2-(3,4-dimethoxy-phenyl)-ethyl]-4-oxo-butyramide::CHEMBL191577
SMILES COc1ccc(CCNC(=O)C[C@H](N)C(=O)N2CCC[C@H]2C#N)cc1OC
InChI Key InChIKey=HJMXMWNMTNQTDK-GJZGRUSLSA-N
Data  2 IC50
  Tab Delimited (TSV)   2D SDfile   Computed 3D by Vconf -m prep SDfile
Find this compound or compounds like it in BindingDB:
Activity Spreadsheet -- Enzyme Inhibition Constant Data from BindingDB
Found 2 hits for monomerid = 50168279
TargetDipeptidyl peptidase 8(Homo sapiens (Human))
National Health Research Institutes
Curated by ChEMBL
LigandPNGBDBM50168279((S)-3-Amino-4-((S)-2-cyano-pyrrolidin-1-yl)-N-[2-(...)
Affinity DataIC50:  177nM. Assay description: Inhibitory concentration against Dipeptidyl-peptidase 8
In DepthDetails ArticlePubMed
TargetDipeptidyl peptidase 4(Homo sapiens (Human))
National Health Research Institutes
Curated by ChEMBL
LigandPNGBDBM50168279((S)-3-Amino-4-((S)-2-cyano-pyrrolidin-1-yl)-N-[2-(...)
Affinity DataIC50:  116nM. Assay description: Inhibitory concentration against Dipeptidyl-peptidase IV [DPP-IV]
In DepthDetails ArticlePubMed