BDBM50168283 (3-hydroxyphenyl)acetic acid::(m-hydroxyphenyl)acetic acid::3-hydroxybenzeneacetic acid::3-hydroxyphenylacetic acid::CHEMBL190035::m-hydroxyphenylacetic acid
SMILES OC(=O)Cc1cccc(O)c1
InChI Key InChIKey=FVMDYYGIDFPZAX-UHFFFAOYSA-N
Data  1 KI  2 IC50
PDB links: 3 PDB IDs match this monomer.
  Tab Delimited (TSV)   2D SDfile   Computed 3D by Vconf -m prep SDfile
Find this compound or compounds like it in BindingDB:
Activity Spreadsheet -- Enzyme Inhibition Constant Data from BindingDB
Found 3 hits for monomerid = 50168283
TargetCalcium/calmodulin-dependent protein kinase type II subunit alpha(Rattus norvegicus (rat))
University Of Copenhagen
Curated by ChEMBL
LigandPNGBDBM50168283((3-hydroxyphenyl)acetic acid | (m-hydroxyphenyl)ac...)
Affinity DataKi:  126nM. Assay description: Inhibition of [3H]NCS-382 binding to CaMK2alpha in rat cerebrocortical membranes
In DepthDetails PubMed
TargetGamma-hydroxybutyrate receptor(RAT)
University Of Maryland
Curated by ChEMBL
LigandPNGBDBM50168283((3-hydroxyphenyl)acetic acid | (m-hydroxyphenyl)ac...)
Affinity DataIC50:  1.20E+4nM. Assay description: Displacement of [3H]-NCS-382 (16 nM) from GHB receptor of rat cerebrocortical membranes
In DepthDetails ArticlePubMed
TargetCalcium/calmodulin-dependent protein kinase type II subunit alpha(Rattus norvegicus (rat))
University Of Copenhagen
Curated by ChEMBL
LigandPNGBDBM50168283((3-hydroxyphenyl)acetic acid | (m-hydroxyphenyl)ac...)
Affinity DataIC50:  0.130nM. Assay description: Inhibition of [3H]NCS-382 binding to CaMK2alpha in rat cerebrocortical membranes
In DepthDetails PubMed