BDBM50168371 6-(3-Hydroxy-phenyl)-naphthalen-2-ol::6-(3-hydroxyphenyl)-2-naphthol::6-(3-hydroxyphenyl)naphthalen-2-ol::CHEMBL195217
SMILES Oc1cccc(c1)-c1ccc2cc(O)ccc2c1
InChI Key InChIKey=VHWBXEUHUQDHDH-UHFFFAOYSA-N
Data  18 IC50
  Tab Delimited (TSV)   2D SDfile   Computed 3D by Vconf -m prep SDfile
Find this compound or compounds like it in BindingDB:
Activity Spreadsheet -- Enzyme Inhibition Constant Data from BindingDB
Found 18 hits for monomerid = 50168371
Target17-beta-hydroxysteroid dehydrogenase type 1(Homo sapiens (Human))
Saarland University
Curated by ChEMBL
LigandPNGBDBM50168371(6-(3-Hydroxy-phenyl)-naphthalen-2-ol | 6-(3-hydrox...)
Affinity DataIC50:  116nM. Assay description: Inhibition of human placental 17beta-HSD1 assessed as conversion of [3H]estrone to [3H]17beta-estradiol
In DepthDetails ArticlePubMed
Target17-beta-hydroxysteroid dehydrogenase type 2(Homo sapiens (Human))
Saarland University
Curated by ChEMBL
LigandPNGBDBM50168371(6-(3-Hydroxy-phenyl)-naphthalen-2-ol | 6-(3-hydrox...)
Affinity DataIC50:  5.64E+3nM. Assay description: Inhibition of human placental 17beta-HSD2
In DepthDetails ArticlePubMed
Target17-beta-hydroxysteroid dehydrogenase type 1(Homo sapiens (Human))
Saarland University
Curated by ChEMBL
LigandPNGBDBM50168371(6-(3-Hydroxy-phenyl)-naphthalen-2-ol | 6-(3-hydrox...)
Affinity DataIC50:  229nM. Assay description: Displacement of [3H]E1 from 17beta-HSD1 in human T47D cells after 10 mins by fluid scintillation counting
In DepthDetails ArticlePubMed
Target17-beta-hydroxysteroid dehydrogenase type 1(Homo sapiens (Human))
Saarland University
Curated by ChEMBL
LigandPNGBDBM50168371(6-(3-Hydroxy-phenyl)-naphthalen-2-ol | 6-(3-hydrox...)
Affinity DataIC50:  116nM. Assay description: Displacement of [3H]E1 from human placental 17beta-HSD1 after 10 mins by fluid scintillation counting
In DepthDetails ArticlePubMed
TargetEstrogen receptor(Homo sapiens (Human))
Wyeth Research
Curated by ChEMBL
LigandPNGBDBM50168371(6-(3-Hydroxy-phenyl)-naphthalen-2-ol | 6-(3-hydrox...)
Affinity DataIC50:  230nM. Assay description: Inhibition of [3H]-17-beta-estradiol binding to human estrogen receptor alpha expressed in Escherichia coli
In DepthDetails ArticlePubMed
TargetEstrogen receptor beta(Homo sapiens (Human))
Wyeth Research
Curated by ChEMBL
LigandPNGBDBM50168371(6-(3-Hydroxy-phenyl)-naphthalen-2-ol | 6-(3-hydrox...)
Affinity DataIC50:  30nM. Assay description: Inhibition of [3H]-17-beta-estradiol binding to human estrogen receptor beta expressed in Escherichia coli
In DepthDetails ArticlePubMed
TargetPolyphenol oxidase 2(Agaricus bisporus (Common mushroom))
Pusan National University
Curated by ChEMBL
LigandPNGBDBM50168371(6-(3-Hydroxy-phenyl)-naphthalen-2-ol | 6-(3-hydrox...)
Affinity DataIC50:  6.40E+3nM. Assay description: Inhibition of mushroom tyrosinase
In DepthDetails ArticlePubMed
Target17-beta-hydroxysteroid dehydrogenase type 2(Homo sapiens (Human))
Saarland University
Curated by ChEMBL
LigandPNGBDBM50168371(6-(3-Hydroxy-phenyl)-naphthalen-2-ol | 6-(3-hydrox...)
Affinity DataIC50:  5.64E+3nM. Assay description: Inhibition of human placental 17beta-HSD2 assessed as conversion of [3H]17beta-estradiol to [3H]estrone
In DepthDetails ArticlePubMed
Target17-beta-hydroxysteroid dehydrogenase type 2(Homo sapiens (Human))
Saarland University
Curated by ChEMBL
LigandPNGBDBM50168371(6-(3-Hydroxy-phenyl)-naphthalen-2-ol | 6-(3-hydrox...)
Affinity DataIC50:  5.64E+3nM. Assay description: Inhibition of [3H]E2 binding to human placental 17beta-HSD2 after 20 mins
In DepthDetails ArticlePubMed
Target17-beta-hydroxysteroid dehydrogenase type 2(Homo sapiens (Human))
Saarland University
Curated by ChEMBL
LigandPNGBDBM50168371(6-(3-Hydroxy-phenyl)-naphthalen-2-ol | 6-(3-hydrox...)
Affinity DataIC50:  5.64E+3nM. Assay description: Displacement of [3H]E2 from human placental 17beta-HSD2 after 10 mins by fluid scintillation counting
In DepthDetails ArticlePubMed
TargetCytochrome P450 1A2(Homo sapiens (Human))
Saarland University
Curated by ChEMBL
LigandPNGBDBM50168371(6-(3-Hydroxy-phenyl)-naphthalen-2-ol | 6-(3-hydrox...)
Affinity DataIC50:  3.99E+3nM. Assay description: Inhibition of human CYP1A2
In DepthDetails ArticlePubMed
TargetCytochrome P450 2B6(Homo sapiens (Human))
Saarland University
Curated by ChEMBL
LigandPNGBDBM50168371(6-(3-Hydroxy-phenyl)-naphthalen-2-ol | 6-(3-hydrox...)
Affinity DataIC50:  1.34E+4nM. Assay description: Inhibition of human CYP2B6
In DepthDetails ArticlePubMed
TargetCytochrome P450 2C9(Homo sapiens (Human))
Saarland University
Curated by ChEMBL
LigandPNGBDBM50168371(6-(3-Hydroxy-phenyl)-naphthalen-2-ol | 6-(3-hydrox...)
Affinity DataIC50:  1.05E+3nM. Assay description: Inhibition of human CYP2C9
In DepthDetails ArticlePubMed
TargetCytochrome P450 2C19(Homo sapiens (Human))
Saarland University
Curated by ChEMBL
LigandPNGBDBM50168371(6-(3-Hydroxy-phenyl)-naphthalen-2-ol | 6-(3-hydrox...)
Affinity DataIC50:  7.54E+3nM. Assay description: Inhibition of human CYP2C19
In DepthDetails ArticlePubMed
TargetCytochrome P450 2D6(Homo sapiens (Human))
Saarland University
Curated by ChEMBL
LigandPNGBDBM50168371(6-(3-Hydroxy-phenyl)-naphthalen-2-ol | 6-(3-hydrox...)
Affinity DataIC50:  3.26E+4nM. Assay description: Inhibition of human CYP2D6
In DepthDetails ArticlePubMed
TargetCytochrome P450 3A4(Homo sapiens (Human))
Saarland University
Curated by ChEMBL
LigandPNGBDBM50168371(6-(3-Hydroxy-phenyl)-naphthalen-2-ol | 6-(3-hydrox...)
Affinity DataIC50:  1.58E+3nM. Assay description: Inhibition of human CYP3A4
In DepthDetails ArticlePubMed
Target17-beta-hydroxysteroid dehydrogenase type 1(Homo sapiens (Human))
Saarland University
Curated by ChEMBL
LigandPNGBDBM50168371(6-(3-Hydroxy-phenyl)-naphthalen-2-ol | 6-(3-hydrox...)
Affinity DataIC50:  116nM. Assay description: Inhibition of human placental 17beta-HSD1
In DepthDetails ArticlePubMed
Target17-beta-hydroxysteroid dehydrogenase type 1(Homo sapiens (Human))
Saarland University
Curated by ChEMBL
LigandPNGBDBM50168371(6-(3-Hydroxy-phenyl)-naphthalen-2-ol | 6-(3-hydrox...)
Affinity DataIC50:  116nM. Assay description: Inhibition of [3H]E1 binding to human placental 17beta-HSD1 after 20 mins
In DepthDetails ArticlePubMed