BDBM50168487 CHEMBL3805835
SMILES NC(=O)c1cncc(OCc2cccc(NC(=O)c3ccc(cc3)-c3ccccn3)c2)c1
InChI Key InChIKey=XYMIRODCWAPIPL-UHFFFAOYSA-N
Data  3 IC50
  Tab Delimited (TSV)   2D SDfile   Computed 3D by Vconf -m prep SDfile
Find this compound or compounds like it in BindingDB:
Activity Spreadsheet -- Enzyme Inhibition Constant Data from BindingDB
Found 3 hits for monomerid = 50168487
TargetNAD-dependent protein deacetylase sirtuin-1(Homo sapiens (Human))
University Of Minnesota
Curated by ChEMBL
LigandPNGBDBM50168487(CHEMBL3805835)
Affinity DataIC50:  2.55E+3nM. Assay description: Inhibition of recombinant human N-terminal His-tagged SIRT1 (1 to 747 residues) expressed in Escherichia coli using Ac-RHK-K(Ac)-AMC as substrate inc...
In DepthDetails ArticlePubMed
TargetNAD-dependent protein deacetylase sirtuin-3, mitochondrial(Homo sapiens (Human))
University Of Minnesota
Curated by ChEMBL
LigandPNGBDBM50168487(CHEMBL3805835)
Affinity DataIC50:  503nM. Assay description: Inhibition of human SIRT3 (102 to 399 residues) expressed in Escherichia coli using Ac-RHK-K(Ac)-AMC as substrate incubated for 2 hrs by fluorescence...
In DepthDetails ArticlePubMed
TargetNAD-dependent protein deacetylase sirtuin-2(Homo sapiens (Human))
University Of Minnesota
Curated by ChEMBL
LigandPNGBDBM50168487(CHEMBL3805835)
Affinity DataIC50:  23nM. Assay description: Inhibition of recombinant human C-terminal His-tagged SIRT2 (50 to 389 residues) expressed in Escherichia coli using Ac-RHK-K(Ac)-AMC as substrate in...
In DepthDetails ArticlePubMed