BDBM50168512 (1-Benzo[1,3]dioxol-5-ylmethyl-piperidin-4-yl)-carbamic acid 3-methoxy-phenyl ester::CHEMBL189508
SMILES COc1cccc(OC(=O)NC2CCN(Cc3ccc4OCOc4c3)CC2)c1
InChI Key InChIKey=NBYGSIBLKKOEBW-UHFFFAOYSA-N
Data  1 IC50
  Tab Delimited (TSV)   2D SDfile   Computed 3D by Vconf -m prep SDfile
Find this compound or compounds like it in BindingDB:
Activity Spreadsheet -- Enzyme Inhibition Constant Data from BindingDB
Found 1 hit for monomerid = 50168512
TargetMelanin-concentrating hormone receptor 1(Mus musculus)
Abbott Laboratories
Curated by ChEMBL
LigandPNGBDBM50168512((1-Benzo[1,3]dioxol-5-ylmethyl-piperidin-4-yl)-car...)
Affinity DataIC50:  1.61E+3nM. Assay description: Inhibitory concentration required for binding affinity against mouse MCHr1 competing human neuronal IMR32 cells receptor in a radiometric binding ass...
In DepthDetails ArticlePubMed