BDBM50168529 CHEMBL188655::Naphthalene-2-carboxylic acid (1-benzo[1,3]dioxol-5-ylmethyl-piperidin-3-yl)-amide
SMILES O=C(NC1CCCN(Cc2ccc3OCOc3c2)C1)c1ccc2ccccc2c1
InChI Key InChIKey=FQLNAFCVABXGKB-UHFFFAOYSA-N
Data  1 IC50
  Tab Delimited (TSV)   2D SDfile   Computed 3D by Vconf -m prep SDfile
Find this compound or compounds like it in BindingDB:
Activity Spreadsheet -- Enzyme Inhibition Constant Data from BindingDB
Found 1 hit for monomerid = 50168529
TargetMelanin-concentrating hormone receptor 1(Mus musculus)
Abbott Laboratories
Curated by ChEMBL
LigandPNGBDBM50168529(CHEMBL188655 | Naphthalene-2-carboxylic acid (1-be...)
Affinity DataIC50:  320nM. Assay description: Inhibitory concentration required for binding affinity against mouse MCHr1 competing human neuronal IMR32 cells receptor in a radiometric binding ass...
In DepthDetails ArticlePubMed