BDBM50168543 (R)-7-[3-(2-Chloro-4-cyclohexyl-phenoxy)-propoxy]-2-methyl-chroman-2-carboxylic acid::CHEMBL179452
SMILES C[C@@]1(CCc2ccc(OCCCOc3ccc(cc3Cl)C3CCCCC3)cc2O1)C(O)=O
InChI Key InChIKey=PJHBYEKCWVZKAI-AREMUKBSSA-N
Data  3 IC50  2 EC50
  Tab Delimited (TSV)   2D SDfile   Computed 3D by Vconf -m prep SDfile
Find this compound or compounds like it in BindingDB:
Activity Spreadsheet -- Enzyme Inhibition Constant Data from BindingDB
Found 5 hits for monomerid = 50168543
TargetPeroxisome proliferator-activated receptor delta(Homo sapiens (Human))
Merck Research Laboratories
Curated by ChEMBL
LigandPNGBDBM50168543((R)-7-[3-(2-Chloro-4-cyclohexyl-phenoxy)-propoxy]-...)
Affinity DataIC50: >1.50E+4nM. Assay description: In vitro binding affinity against human PPARdelta
In DepthDetails ArticlePubMed
TargetPeroxisome proliferator-activated receptor gamma(Homo sapiens (Human))
Merck Research Laboratories
Curated by ChEMBL
LigandPNGBDBM50168543((R)-7-[3-(2-Chloro-4-cyclohexyl-phenoxy)-propoxy]-...)
Affinity DataIC50:  5.80E+3nM. Assay description: In vitro binding affinity against human PPARgamma
In DepthDetails ArticlePubMed
TargetPeroxisome proliferator-activated receptor gamma(Homo sapiens (Human))
Merck Research Laboratories
Curated by ChEMBL
LigandPNGBDBM50168543((R)-7-[3-(2-Chloro-4-cyclohexyl-phenoxy)-propoxy]-...)
Affinity DataEC50:  700nM. Assay description: Agonist activity against human PPARgamma in COS-1 cell Gal4 assay
In DepthDetails ArticlePubMed
TargetPeroxisome proliferator-activated receptor alpha(Homo sapiens (Human))
Merck Research Laboratories
Curated by ChEMBL
LigandPNGBDBM50168543((R)-7-[3-(2-Chloro-4-cyclohexyl-phenoxy)-propoxy]-...)
Affinity DataEC50:  2nM. Assay description: Agonist activity against human PPARalpha in COS-1 cell Gal4 assay
In DepthDetails ArticlePubMed
TargetPeroxisome proliferator-activated receptor alpha(Homo sapiens (Human))
Merck Research Laboratories
Curated by ChEMBL
LigandPNGBDBM50168543((R)-7-[3-(2-Chloro-4-cyclohexyl-phenoxy)-propoxy]-...)
Affinity DataIC50:  28nM. Assay description: In vitro binding affinity against human PPARalpha
In DepthDetails ArticlePubMed