BDBM50168916 1-(3,5-Dihydroxy-2-hydroxymethyl-6-methylsulfanyl-tetrahydro-pyran-4-yl)-1H-[1,2,3]triazole-4-carboxylic acid methyl ester::CHEMBL178845
SMILES COC(=O)c1cn(nn1)C1C(O)C(CO)OC(SC)C1O
InChI Key InChIKey=BXGNCMNGDGUSTO-UHFFFAOYSA-N
Data  1 Kd
  Tab Delimited (TSV)   2D SDfile   Computed 3D by Vconf -m prep SDfile
Find this compound or compounds like it in BindingDB:
Activity Spreadsheet -- Enzyme Inhibition Constant Data from BindingDB
Found 1 hit for monomerid = 50168916
TargetGalectin-3(Mus musculus)
Lund University
Curated by ChEMBL
LigandPNGBDBM50168916(1-(3,5-Dihydroxy-2-hydroxymethyl-6-methylsulfanyl-...)
Affinity DataKd:  1.41E+6nM. Assay description: Dissociation constant for mouse Galectin-3
In DepthDetails ArticlePubMed