BDBM50169085 CHEMBL3805898
SMILES [O-][N+](=O)c1ccc(NCCCCN2CCC(CC2)Nc2nc3ccccc3n2Cc2ccc(F)cc2)c2nonc12
InChI Key InChIKey=RUHGWVMBVBUOMQ-UHFFFAOYSA-N
Data  1 KI  1 IC50
  Tab Delimited (TSV)   2D SDfile   Computed 3D by Vconf -m prep SDfile
Find this compound or compounds like it in BindingDB:
Activity Spreadsheet -- Enzyme Inhibition Constant Data from BindingDB
Found 2 hits for monomerid = 50169085
TargetPotassium voltage-gated channel subfamily H member 2(Homo sapiens (Human))
Shandong University
Curated by ChEMBL
LigandPNGBDBM50169085(CHEMBL3805898)
Affinity DataKi:  12nM. Assay description: Displacement of [3H] dofetilide from human ERG channel expressed in HEK293 cell membranes incubated for 2 hrs by scintillation counting analysis
In DepthDetails ArticlePubMed
TargetPotassium voltage-gated channel subfamily H member 2(Homo sapiens (Human))
Shandong University
Curated by ChEMBL
LigandPNGBDBM50169085(CHEMBL3805898)
Affinity DataIC50:  25nM. Assay description: Displacement of [3H] dofetilide from human ERG channel expressed in HEK293 cell membranes incubated for 2 hrs by scintillation counting analysis
In DepthDetails ArticlePubMed