BDBM50169272 3-Aza-bicyclo[3.2.0]heptane-3-carboxylic acid 2-((S)-1-hydroxy-3-methyl-butyl)-1-methoxy-8-methyl-11-oxo-11H-dibenzo[b,e][1,4]dioxepin-6-yl ester::CHEMBL185655
SMILES COc1c(ccc2Oc3c(OC(=O)N4CC5CCC5C4)cc(C)cc3OC(=O)c12)[C@@H](O)CC(C)C
InChI Key InChIKey=JHKVRCLEHWEWPJ-TVPLGVNVSA-N
Data  1 IC50
  Tab Delimited (TSV)   2D SDfile   Computed 3D by Vconf -m prep SDfile
Find this compound or compounds like it in BindingDB:
Activity Spreadsheet -- Enzyme Inhibition Constant Data from BindingDB
Found 1 hit for monomerid = 50169272
TargetCholesteryl ester transfer protein(Homo sapiens (Human))
Bayer Healthcare Pharma Research
Curated by ChEMBL
LigandPNGBDBM50169272(3-Aza-bicyclo[3.2.0]heptane-3-carboxylic acid 2-((...)
Affinity DataIC50:  400nM. Assay description: Inhibitory concentration against Cholesterol ester transfer protein (CETP) in CETP fluorescence assay
In DepthDetails ArticlePubMed