BDBM50169401 CHEMBL3806161
SMILES COc1ccc(cc1OC)[C@@H]1C[C@H](N=C(N)S1)c1cccc(c1)-c1cncnc1
InChI Key InChIKey=PWMVRXRKSCIKJR-RXVVDRJESA-N
Data  1 IC50
  Tab Delimited (TSV)   2D SDfile   Computed 3D by Vconf -m prep SDfile
Find this compound or compounds like it in BindingDB:
Activity Spreadsheet -- Enzyme Inhibition Constant Data from BindingDB
Found 1 hit for monomerid = 50169401
TargetBeta-secretase 1(Homo sapiens (Human))
Bristol-Myers Squibb
Curated by ChEMBL
LigandPNGBDBM50169401(CHEMBL3806161)
Affinity DataIC50:  1.10E+3nM. Assay description: Inhibition of BACE1 in human H4 cells expressing APP751 Swedish mutant assessed as inhibition of amyloid beta 40 or amyloid beta 42 production incuba...
In DepthDetails ArticlePubMed