BDBM50169619 CHEMBL3804910
SMILES Cn1c2nc(ccc2n(CC(C)(C)C)c1=O)N1CC2CCC1CN2C(=O)OC(C)(C)C
InChI Key InChIKey=FYQHOZQRGLULQN-UHFFFAOYSA-N
Data  5 EC50
  Tab Delimited (TSV)   2D SDfile   Computed 3D by Vconf -m prep SDfile
Find this compound or compounds like it in BindingDB:
Activity Spreadsheet -- Enzyme Inhibition Constant Data from BindingDB
Found 5 hits for monomerid = 50169619
TargetMetabotropic glutamate receptor 2(Homo sapiens (Human))
Merck Research Laboratories
Curated by ChEMBL
LigandPNGBDBM50169619(CHEMBL3804910)
Affinity DataEC50:  125nM. Assay description: Positive allosteric modulation of recombinant human mGlu2 receptor expressed in CHO cells assessed as potentiation of glutamate-induced effect preinc...
In DepthDetails ArticlePubMed
TargetMetabotropic glutamate receptor 3(Homo sapiens (Human))
Merck Research Laboratories
Curated by ChEMBL
LigandPNGBDBM50169619(CHEMBL3804910)
Affinity DataEC50: >3.00E+4nM. Assay description: Positive allosteric modulation of mGlu3 receptor (unknown origin)
In DepthDetails ArticlePubMed
TargetMetabotropic glutamate receptor 6(Homo sapiens (Human))
Merck Research Laboratories
Curated by ChEMBL
LigandPNGBDBM50169619(CHEMBL3804910)
Affinity DataEC50: >3.00E+4nM. Assay description: Positive allosteric modulation of mGlu6 receptor (unknown origin)
In DepthDetails ArticlePubMed
TargetMetabotropic glutamate receptor 5(Homo sapiens (Human))
Merck Research Laboratories
Curated by ChEMBL
LigandPNGBDBM50169619(CHEMBL3804910)
Affinity DataEC50: >3.00E+4nM. Assay description: Positive allosteric modulation of mGlu5 receptor (unknown origin)
In DepthDetails ArticlePubMed
TargetMetabotropic glutamate receptor 4(Homo sapiens (Human))
Merck Research Laboratories
Curated by ChEMBL
LigandPNGBDBM50169619(CHEMBL3804910)
Affinity DataEC50: >3.00E+4nM. Assay description: Positive allosteric modulation of mGlu4 receptor (unknown origin)
In DepthDetails ArticlePubMed