BDBM50169627 7-Cyclopentyl-2-{2-ethoxy-5-[4-(2-hydroxy-ethyl)-piperazine-1-sulfonyl]-phenyl}-5-methyl-3H-imidazo[5,1-f][1,2,4]triazin-4-one::CHEMBL369081
SMILES CCOc1ccc(cc1-c1nn2c(nc(C)c2c(=O)[nH]1)C1CCCC1)S(=O)(=O)N1CCN(CCO)CC1
InChI Key InChIKey=JKKDCZMQLGLGTR-UHFFFAOYSA-N
Data  2 IC50
  Tab Delimited (TSV)   2D SDfile   Computed 3D by Vconf -m prep SDfile
Find this compound or compounds like it in BindingDB:
Activity Spreadsheet -- Enzyme Inhibition Constant Data from BindingDB
Found 2 hits for monomerid = 50169627
LigandPNGBDBM50169627(7-Cyclopentyl-2-{2-ethoxy-5-[4-(2-hydroxy-ethyl)-p...)
Affinity DataIC50:  10nM. Assay description: Inhibition of phosphodiesterase 1
In DepthDetails ArticlePubMed
TargetcGMP-specific 3',5'-cyclic phosphodiesterase(Homo sapiens (Human))
Bayer Healthcare
Curated by ChEMBL
LigandPNGBDBM50169627(7-Cyclopentyl-2-{2-ethoxy-5-[4-(2-hydroxy-ethyl)-p...)
Affinity DataIC50:  1nM. Assay description: Inhibition of phosphodiesterase 5
In DepthDetails ArticlePubMed