BDBM50169656 5-(2-Methyl-but-3-enoylamino)-thiazole-4-carboxylic acid thiazol-2-ylamide::CHEMBL359851
SMILES CC(C=C)C(=O)Nc1scnc1C(=O)Nc1nccs1
InChI Key InChIKey=NTZQHHLLIHUMMD-UHFFFAOYSA-N
Data  2 IC50
  Tab Delimited (TSV)   2D SDfile   Computed 3D by Vconf -m prep SDfile
Find this compound or compounds like it in BindingDB:
Activity Spreadsheet -- Enzyme Inhibition Constant Data from BindingDB
Found 2 hits for monomerid = 50169656
TargetMethionine aminopeptidase(Escherichia coli (strain K12))
Graduate School Of The Chinese Academy Of Sciences
Curated by ChEMBL
LigandPNGBDBM50169656(5-(2-Methyl-but-3-enoylamino)-thiazole-4-carboxyli...)
Affinity DataIC50:  44nM. Assay description: Inhibitory concentration required against Escherichia coli MetAP1 (150 nM)
In DepthDetails ArticlePubMed
TargetMethionine aminopeptidase 1(Saccharomyces cerevisiae)
Graduate School Of The Chinese Academy Of Sciences
Curated by ChEMBL
LigandPNGBDBM50169656(5-(2-Methyl-but-3-enoylamino)-thiazole-4-carboxyli...)
Affinity DataIC50:  370nM. Assay description: Inhibitory concentration required against Saccharomyces cerevisiae MetAP1 (330 nM)
In DepthDetails ArticlePubMed