BDBM50169693 CHEMBL3805139
SMILES [H][C@@]12CC[C@@]([H])(C=C1c1ccc3n(CC(C)(C)C)c(=O)n(C)c3n1)N(C2)C(=O)c1ccon1
InChI Key InChIKey=QMGWNCFCWXUZEI-GJZGRUSLSA-N
Data  5 EC50
  Tab Delimited (TSV)   2D SDfile   Computed 3D by Vconf -m prep SDfile
Find this compound or compounds like it in BindingDB:
Activity Spreadsheet -- Enzyme Inhibition Constant Data from BindingDB
Found 5 hits for monomerid = 50169693
TargetMetabotropic glutamate receptor 2(Homo sapiens (Human))
Merck Research Laboratories
Curated by ChEMBL
LigandPNGBDBM50169693(CHEMBL3805139)
Affinity DataEC50:  16nM. Assay description: Positive allosteric modulation of recombinant human mGlu2 receptor expressed in CHO cells assessed as potentiation of glutamate-induced effect preinc...
In DepthDetails ArticlePubMed
TargetMetabotropic glutamate receptor 3(Homo sapiens (Human))
Merck Research Laboratories
Curated by ChEMBL
LigandPNGBDBM50169693(CHEMBL3805139)
Affinity DataEC50: >3.00E+4nM. Assay description: Positive allosteric modulation of mGlu3 receptor (unknown origin)
In DepthDetails ArticlePubMed
TargetMetabotropic glutamate receptor 6(Homo sapiens (Human))
Merck Research Laboratories
Curated by ChEMBL
LigandPNGBDBM50169693(CHEMBL3805139)
Affinity DataEC50: >3.00E+4nM. Assay description: Positive allosteric modulation of mGlu6 receptor (unknown origin)
In DepthDetails ArticlePubMed
TargetMetabotropic glutamate receptor 5(Homo sapiens (Human))
Merck Research Laboratories
Curated by ChEMBL
LigandPNGBDBM50169693(CHEMBL3805139)
Affinity DataEC50: >3.00E+4nM. Assay description: Positive allosteric modulation of mGlu5 receptor (unknown origin)
In DepthDetails ArticlePubMed
TargetMetabotropic glutamate receptor 4(Homo sapiens (Human))
Merck Research Laboratories
Curated by ChEMBL
LigandPNGBDBM50169693(CHEMBL3805139)
Affinity DataEC50: >3.00E+4nM. Assay description: Positive allosteric modulation of mGlu4 receptor (unknown origin)
In DepthDetails ArticlePubMed