BDBM50169867 2-(3-Dimethylaminomethyl-phenoxy)-5,6-dimethoxy-indan-1-one::CHEMBL181310
SMILES COc1cc2CC(Oc3cccc(CN(C)C)c3)C(=O)c2cc1OC
InChI Key InChIKey=JREZJVHKBPEZND-UHFFFAOYSA-N
Data  1 KI  3 IC50
  Tab Delimited (TSV)   2D SDfile   Computed 3D by Vconf -m prep SDfile
Find this compound or compounds like it in BindingDB:
Activity Spreadsheet -- Enzyme Inhibition Constant Data from BindingDB
Found 4 hits for monomerid = 50169867
TargetAcetylcholinesterase(Homo sapiens (Human))TBA
LigandPNGBDBM50169867(2-(3-Dimethylaminomethyl-phenoxy)-5,6-dimethoxy-in...)
Affinity DataKi:  1.00E+3nM. Assay description: Binding affinity to acetylcholinesterase (unknown origin)
In DepthDetails Article
TargetAcetylcholinesterase(Rattus norvegicus (rat))TBA
LigandPNGBDBM50169867(2-(3-Dimethylaminomethyl-phenoxy)-5,6-dimethoxy-in...)
Affinity DataIC50:  1.10E+3nM. Assay description: Inhibition of acetylcholinesterase in Rattus norvegicus (rat) cortex by Ellman method
In DepthDetails Article
TargetCarboxylic ester hydrolase(Rattus norvegicus (rat))
Zhejiang University
Curated by ChEMBL
LigandPNGBDBM50169867(2-(3-Dimethylaminomethyl-phenoxy)-5,6-dimethoxy-in...)
Affinity DataIC50:  2.07E+5nM. Assay description: In vitro inhibitory concentration against butyrylcholinesterase was determined using rat serum homogenate
In DepthDetails ArticlePubMed
TargetAcetylcholinesterase(Rattus norvegicus (rat))TBA
LigandPNGBDBM50169867(2-(3-Dimethylaminomethyl-phenoxy)-5,6-dimethoxy-in...)
Affinity DataIC50:  1.10E+3nM. Assay description: In vitro inhibitory concentration against rat cortex acetylcholinesterase
In DepthDetails ArticlePubMed