BDBM50169991 CHEMBL364053::[3H-Benzothiazol-(2Z)-ylidene]-(2-benzylamino-pyrimidin-4-yl)-acetonitrile
SMILES N#CC(c1nc2ccccc2s1)c1ccnc(NCc2ccccc2)n1
InChI Key InChIKey=JBOHGFWMTSRPMY-UHFFFAOYSA-N
Data  1 IC50
  Tab Delimited (TSV)   2D SDfile   Computed 3D by Vconf -m prep SDfile
Find this compound or compounds like it in BindingDB:
Activity Spreadsheet -- Enzyme Inhibition Constant Data from BindingDB
Found 1 hit for monomerid = 50169991
TargetMitogen-activated protein kinase 10(Rattus norvegicus)
Serono Pharmaceutical Research Institute
Curated by ChEMBL
LigandPNGBDBM50169991(CHEMBL364053 | [3H-Benzothiazol-(2Z)-ylidene]-(2-b...)
Affinity DataIC50:  6.50E+3nM. Assay description: Inhibition of rat c-Jun N-terminal kinase 3
In DepthDetails ArticlePubMed