BDBM50170491 6-(4-Acetyl-2-ethyl-5-hydroxy-phenoxymethyl)-pyridine-2-carboxylic acid (7-hydroxycarbamoyl-heptyl)-amide::CHEMBL362512
SMILES CCc1cc(C(C)=O)c(O)cc1OCc1cccc(n1)C(=O)NCCCCCCCC(=O)NO
InChI Key InChIKey=GUEGDRDOUGKEEH-UHFFFAOYSA-N
Data  2 IC50
  Tab Delimited (TSV)   2D SDfile   Computed 3D by Vconf -m prep SDfile
Find this compound or compounds like it in BindingDB:
Activity Spreadsheet -- Enzyme Inhibition Constant Data from BindingDB
Found 2 hits for monomerid = 50170491
TargetcGMP-specific 3',5'-cyclic phosphodiesterase(Homo sapiens (Human))
Sumitomo Pharmaceuticals
Curated by ChEMBL
LigandPNGBDBM50170491(6-(4-Acetyl-2-ethyl-5-hydroxy-phenoxymethyl)-pyrid...)
Affinity DataIC50:  74nM. Assay description: Inhibitory concentration against Phosphodiesterase type 5
In DepthDetails ArticlePubMed
LigandPNGBDBM50170491(6-(4-Acetyl-2-ethyl-5-hydroxy-phenoxymethyl)-pyrid...)
Affinity DataIC50:  43nM. Assay description: Inhibitory concentration against Phosphodiesterase type 1
In DepthDetails ArticlePubMed