BDBM50170901 CHEMBL3805587
SMILES NC(CN1CCOCC1)P(O)(O)=O
InChI Key InChIKey=MYBQWHIHPBOCKG-UHFFFAOYSA-N
Data  4 KI
  Tab Delimited (TSV)   2D SDfile   Computed 3D by Vconf -m prep SDfile
Find this compound or compounds like it in BindingDB:
Activity Spreadsheet -- Enzyme Inhibition Constant Data from BindingDB
Found 4 hits for monomerid = 50170901
TargetAminopeptidase N(Homo sapiens (Human))
Wroclaw University Of Technology
Curated by ChEMBL
LigandPNGBDBM50170901(CHEMBL3805587)
Affinity DataKi:  3.77E+4nM. Assay description: Inhibition of recombinant human alanyl aminopeptidase M1 using Ala-AMC as substrate preincubated for 30 to 60 mins followed by substrate addition mea...
In DepthDetails ArticlePubMed
TargetAminopeptidase N(Sus scrofa (Pig))
Wroclaw University Of Technology
Curated by ChEMBL
LigandPNGBDBM50170901(CHEMBL3805587)
Affinity DataKi:  9.42E+4nM. Assay description: Inhibition of pig kidney alanyl aminopeptidase M1 using Ala-AMC as substrate preincubated for 30 to 60 mins followed by substrate addition measured f...
In DepthDetails ArticlePubMed
TargetEndoplasmic reticulum aminopeptidase 2(Homo sapiens (Human))
Wroclaw University Of Technology
Curated by ChEMBL
LigandPNGBDBM50170901(CHEMBL3805587)
Affinity DataKi: >2.50E+5nM. Assay description: Inhibition of human ERAP2 preincubated for 30 to 60 mins followed by addition of Arg-AMC as substrate measured for 15 mins by spectrofluorimetric met...
In DepthDetails ArticlePubMed
TargetEndoplasmic reticulum aminopeptidase 1(Homo sapiens (Human))
Wroclaw University Of Technology
Curated by ChEMBL
LigandPNGBDBM50170901(CHEMBL3805587)
Affinity DataKi: >2.50E+5nM. Assay description: Inhibition of human ERAP1 preincubated for 30 to 60 mins followed by addition of Leu-AMC as substrate measured for 15 mins by spectrofluorimetric met...
In DepthDetails ArticlePubMed