BDBM50171079 CHEMBL3805403
SMILES CCc1cc2cc(ccc2nc1CC)N(C)C
InChI Key InChIKey=SVKMRJSVMOCUME-UHFFFAOYSA-N
Data  1 IC50
  Tab Delimited (TSV)   2D SDfile   Computed 3D by Vconf -m prep SDfile
Find this compound or compounds like it in BindingDB:
Activity Spreadsheet -- Enzyme Inhibition Constant Data from BindingDB
Found 1 hit for monomerid = 50171079
TargetProteasome subunit beta type-5(Homo sapiens (Human))
Michigan State University
Curated by ChEMBL
LigandPNGBDBM50171079(CHEMBL3805403)
Affinity DataIC50:  1.87E+4nM. Assay description: Inhibition of human 20S proteasome chymotryptic-like activity using Suc-LLVY-AMC as substrate measured for 30 mins by fluorescence assay
In DepthDetails ArticlePubMed