BDBM50171121 CHEMBL197827::{4-[[4-(Difluoro-phosphono-methyl)-benzyl]-(4-[1,2,3]thiadiazol-4-yl-benzyl)-carbamoyl]-phenoxy}-acetic acid
SMILES OC(=O)COc1ccc(cc1)C(=O)N(Cc1ccc(cc1)-c1csnn1)Cc1ccc(cc1)C(F)(F)P(O)(O)=O
InChI Key InChIKey=GMALMXCDHHXTFM-UHFFFAOYSA-N
Data  1 IC50
  Tab Delimited (TSV)   2D SDfile   Computed 3D by Vconf -m prep SDfile
Find this compound or compounds like it in BindingDB:
Activity Spreadsheet -- Enzyme Inhibition Constant Data from BindingDB
Found 1 hit for monomerid = 50171121
TargetTyrosine-protein phosphatase non-receptor type 1(Homo sapiens (Human))
Affymax
Curated by ChEMBL
LigandPNGBDBM50171121(CHEMBL197827 | {4-[[4-(Difluoro-phosphono-methyl)-...)
Affinity DataIC50:  2.30E+3nM. Assay description: Inhibitory activity against protein tyrosine phosphatase 1B using O-methyl fluorescein monophosphate
In DepthDetails ArticlePubMed