BDBM50171245 5-Chloro-2-propyl-3-(1,2,3,6-tetrahydro-pyridin-4-yl)-1H-indole::CHEMBL435126
SMILES CCCc1[nH]c2ccc(Cl)cc2c1C1=CCNCC1
InChI Key InChIKey=AOQRGRBHHLFOEW-UHFFFAOYSA-N
Data  1 IC50
  Tab Delimited (TSV)   2D SDfile   Computed 3D by Vconf -m prep SDfile
Find this compound or compounds like it in BindingDB:
Activity Spreadsheet -- Enzyme Inhibition Constant Data from BindingDB
Found 1 hit for monomerid = 50171245
Target5-hydroxytryptamine receptor 6(Homo sapiens (Human))
Carlsson Research
Curated by ChEMBL
LigandPNGBDBM50171245(5-Chloro-2-propyl-3-(1,2,3,6-tetrahydro-pyridin-4-...)
Affinity DataIC50:  40nM. Assay description: Displacement of [3H]-LSD binding to cloned human 5-hydroxytryptamine 6 receptor expressed in HEK cells
In DepthDetails ArticlePubMed