BDBM50171246 5-Chloro-2-methyl-3-(1-propyl-1,2,3,6-tetrahydro-pyridin-4-yl)-1H-indole::CHEMBL371203
SMILES CCCN1CCC(=CC1)c1c(C)[nH]c2ccc(Cl)cc12
InChI Key InChIKey=HHRWYAZBQFJQJN-UHFFFAOYSA-N
Data  1 IC50
  Tab Delimited (TSV)   2D SDfile   Computed 3D by Vconf -m prep SDfile
Find this compound or compounds like it in BindingDB:
Activity Spreadsheet -- Enzyme Inhibition Constant Data from BindingDB
Found 1 hit for monomerid = 50171246
Target5-hydroxytryptamine receptor 6(Homo sapiens (Human))
Carlsson Research
Curated by ChEMBL
LigandPNGBDBM50171246(5-Chloro-2-methyl-3-(1-propyl-1,2,3,6-tetrahydro-p...)
Affinity DataIC50:  60nM. Assay description: Displacement of [3H]-LSD binding to cloned human 5-hydroxytryptamine 6 receptor expressed in HEK cells
In DepthDetails ArticlePubMed