BDBM50171337 5-[3-(3-Chloro-phenyl)-ureido]-2-dimethylamino-N-(3-ethoxy-propyl)-benzamide::CHEMBL190644
SMILES CCOCCCNC(=O)c1cc(NC(=O)Nc2cccc(Cl)c2)ccc1N(C)C
InChI Key InChIKey=KTSSYRXXUBATJX-UHFFFAOYSA-N
Data  1 KI  1 IC50  1 EC50
  Tab Delimited (TSV)   2D SDfile   Computed 3D by Vconf -m prep SDfile
Find this compound or compounds like it in BindingDB:
Activity Spreadsheet -- Enzyme Inhibition Constant Data from BindingDB
Found 3 hits for monomerid = 50171337
TargetBeta-secretase 1(Homo sapiens (Human))
University Of ZüRich
Curated by ChEMBL
LigandPNGBDBM50171337(5-[3-(3-Chloro-phenyl)-ureido]-2-dimethylamino-N-(...)
Affinity DataKi:  9.80E+3nM. Assay description: Predicted binding affinity for beta secretase by linear interaction energy continuum electrostatics
In DepthDetails ArticlePubMed
TargetBeta-secretase 1(Homo sapiens (Human))
University Of ZüRich
Curated by ChEMBL
LigandPNGBDBM50171337(5-[3-(3-Chloro-phenyl)-ureido]-2-dimethylamino-N-(...)
Affinity DataIC50:  97nM. Assay description: Inhibitory concentration against beta-site APP cleaving enzyme (BACE-1) by fluorescence resonance energy transfer assay
In DepthDetails ArticlePubMed
TargetBeta-secretase 1/2(Homo sapiens (Human))
University Of ZüRich
Curated by ChEMBL
LigandPNGBDBM50171337(5-[3-(3-Chloro-phenyl)-ureido]-2-dimethylamino-N-(...)
Affinity DataEC50:  23nM. Assay description: Beta-secretase inhibitory activity as inhibition of secreted alkaline phosphatase in HEK293 cells expressing SEAP-APP fusion protein
In DepthDetails ArticlePubMed