BDBM50171433 2-[5-(3-Chloro-thiophen-2-yl)-[1,2,4]oxadiazol-3-yl]-5-trifluoromethyl-pyridine::CHEMBL189419
SMILES FC(F)(F)c1ccc(nc1)-c1noc(n1)-c1sccc1Cl
InChI Key InChIKey=UQRQBELNAZQFGA-UHFFFAOYSA-N
Data  3 EC50
  Tab Delimited (TSV)   2D SDfile   Computed 3D by Vconf -m prep SDfile
Find this compound or compounds like it in BindingDB:
Activity Spreadsheet -- Enzyme Inhibition Constant Data from BindingDB
Found 3 hits for monomerid = 50171433
TargetCaspase-3(Homo sapiens (Human))
Maxim Pharmaceuticals
Curated by ChEMBL
LigandPNGBDBM50171433(2-[5-(3-Chloro-thiophen-2-yl)-[1,2,4]oxadiazol-3-y...)
Affinity DataEC50:  1.44E+3nM. Assay description: Caspase-3 activation activity tested in T47D breast cells done for 24 or 48 h at 37 degree C
In DepthDetails ArticlePubMed
TargetCaspase-3(Homo sapiens (Human))
Maxim Pharmaceuticals
Curated by ChEMBL
LigandPNGBDBM50171433(2-[5-(3-Chloro-thiophen-2-yl)-[1,2,4]oxadiazol-3-y...)
Affinity DataEC50:  410nM. Assay description: Caspase-3 activation activity tested in DLD1 colon cells done for 24 or 48 h at 37 degree C
In DepthDetails ArticlePubMed
TargetCaspase-3(Homo sapiens (Human))
Maxim Pharmaceuticals
Curated by ChEMBL
LigandPNGBDBM50171433(2-[5-(3-Chloro-thiophen-2-yl)-[1,2,4]oxadiazol-3-y...)
Affinity DataEC50: >1.00E+4nM. Assay description: Caspase-3 activation activity tested in H1299 lung cancer cells done for 24 or 48 h at 37 degree C
In DepthDetails ArticlePubMed