BDBM50171553 2,5-Diamino-pentanoic acid ((R)-1-boron-dihydroxide-pentyl)-amide::CHEMBL373319
SMILES CCCC[C@@H](NC(=O)[C@@H](N)CCCN)B(O)O
InChI Key InChIKey=NXACEUWQZHJCCT-DTWKUNHWSA-N
Data  4 IC50
  Tab Delimited (TSV)   2D SDfile   Computed 3D by Vconf -m prep SDfile
Find this compound or compounds like it in BindingDB:
Activity Spreadsheet -- Enzyme Inhibition Constant Data from BindingDB
Found 4 hits for monomerid = 50171553
TargetDipeptidyl peptidase 9(Homo sapiens (Human))
Activx Biosciences
Curated by ChEMBL
LigandPNGBDBM50171553(2,5-Diamino-pentanoic acid ((R)-1-boron-dihydroxid...)
Affinity DataIC50:  400nM. Assay description: Inhibitory concentration against human dipeptidylpeptidase 9 using FP-TAMRA incubated for 30 min
In DepthDetails ArticlePubMed
TargetDipeptidyl peptidase 2(Homo sapiens (Human))
Activx Biosciences
Curated by ChEMBL
LigandPNGBDBM50171553(2,5-Diamino-pentanoic acid ((R)-1-boron-dihydroxid...)
Affinity DataIC50:  4.70nM. Assay description: Inhibitory concentration against human dipeptidylpeptidase 7
In DepthDetails ArticlePubMed
TargetDipeptidyl peptidase 8(Homo sapiens (Human))
Activx Biosciences
Curated by ChEMBL
LigandPNGBDBM50171553(2,5-Diamino-pentanoic acid ((R)-1-boron-dihydroxid...)
Affinity DataIC50:  2.60E+3nM. Assay description: Inhibitory concentration against human dipeptidylpeptidase 8 using FP-TAMRA incubated for 30 min
In DepthDetails ArticlePubMed
TargetDipeptidyl peptidase 4(Homo sapiens (Human))
Activx Biosciences
Curated by ChEMBL
LigandPNGBDBM50171553(2,5-Diamino-pentanoic acid ((R)-1-boron-dihydroxid...)
Affinity DataIC50:  1.20E+3nM. Assay description: Inhibitory concentration against human dipeptidylpeptidase 4
In DepthDetails ArticlePubMed