BDBM50171873 CHEMBL3805952
SMILES OC(=O)CCc1ccc(OCc2nnc(s2)C(=O)Nc2ccc(F)c(F)c2)cc1
InChI Key InChIKey=YCKOJEXQUBDOSS-UHFFFAOYSA-N
Data  4 EC50
  Tab Delimited (TSV)   2D SDfile   Computed 3D by Vconf -m prep SDfile
Find this compound or compounds like it in BindingDB:
Activity Spreadsheet -- Enzyme Inhibition Constant Data from BindingDB
Found 4 hits for monomerid = 50171873
TargetFree fatty acid receptor 4(Homo sapiens (Human))
Saint Petersburg State University
Curated by ChEMBL
LigandPNGBDBM50171873(CHEMBL3805952)
Affinity DataEC50: >1.00E+4nM. Assay description: Agonist activity at human GPR120 (unknown origin) expressed in CHO cells by calcium influx assay
In DepthDetails ArticlePubMed
TargetFree fatty acid receptor 1(Homo sapiens (Human))
Saint Petersburg State University
Curated by ChEMBL
LigandPNGBDBM50171873(CHEMBL3805952)
Affinity DataEC50:  580nM. Assay description: Agonist activity at human GPR40 expressed in CHO cells by calcium influx assay
In DepthDetails ArticlePubMed
TargetFree fatty acid receptor 3(Homo sapiens (Human))
Saint Petersburg State University
Curated by ChEMBL
LigandPNGBDBM50171873(CHEMBL3805952)
Affinity DataEC50: >1.00E+4nM. Assay description: Agonist activity at human GPR41 (unknown origin) expressed in CHO cells by calcium influx assay
In DepthDetails ArticlePubMed
TargetFree fatty acid receptor 2(Homo sapiens (Human))
Saint Petersburg State University
Curated by ChEMBL
LigandPNGBDBM50171873(CHEMBL3805952)
Affinity DataEC50: >1.00E+4nM. Assay description: Agonist activity at human GPR43 (unknown origin) expressed in CHO cells by calcium influx assay
In DepthDetails ArticlePubMed