BDBM50172109 CHEMBL3809575
SMILES CC(=O)n1cc(-c2c(C)n(C(=O)CCc3ccccc3)n(C(=O)CCc3ccccc3)c2=O)c2ccccc12
InChI Key InChIKey=FXXFMGCCUOEKME-UHFFFAOYSA-N
Data  2 Kd
  Tab Delimited (TSV)   2D SDfile   Computed 3D by Vconf -m prep SDfile
Find this compound or compounds like it in BindingDB:
Activity Spreadsheet -- Enzyme Inhibition Constant Data from BindingDB
Found 2 hits for monomerid = 50172109
TargetBromodomain-containing protein 9(Homo sapiens (Human))
University Of Z£Rich
Curated by ChEMBL
LigandPNGBDBM50172109(CHEMBL3809575)
Affinity DataKd:  3.50E+3nM. Assay description: Competitive binding affinity to BRD9 bromodomain (unknown origin) measured after 1 hr by BROMOscan assay
In DepthDetails ArticlePubMed
TargetCREB-binding protein(Homo sapiens (Human))
University Of Z£Rich
Curated by ChEMBL
LigandPNGBDBM50172109(CHEMBL3809575)
Affinity DataKd:  1.70E+4nM. Assay description: Competitive binding affinity to CBP (unknown origin) measured after 1 hr by BROMOscan assay
In DepthDetails ArticlePubMed