BDBM50172114 CHEMBL3808440
SMILES COc1ccc(C)c(c1)N(C(=O)c1cccc(c1)C(F)(F)F)c1cn(C(C)=O)c2ccccc12
InChI Key InChIKey=BYQBYBUGRMJLNZ-UHFFFAOYSA-N
Data  1 Kd
  Tab Delimited (TSV)   2D SDfile   Computed 3D by Vconf -m prep SDfile
Find this compound or compounds like it in BindingDB:
Activity Spreadsheet -- Enzyme Inhibition Constant Data from BindingDB
Found 1 hit for monomerid = 50172114
TargetBromodomain adjacent to zinc finger domain protein 2B(Homo sapiens (Human))
University Of Z£Rich
Curated by ChEMBL
LigandPNGBDBM50172114(CHEMBL3808440)
Affinity DataKd:  1.40E+5nM. Assay description: Competitive binding affinity to human His-tagged BRAZ2B (1858 to 1972 residues) expressed in T7 phage-infected Escherichia coli BL21(DE3) cells measu...
In DepthDetails ArticlePubMed