BDBM50172214 6-[6-(3-Carbamimidoyl-phenoxy)-3,5-difluoro-4-(1-methyl-3-phenyl-propylamino)-pyridin-2-yloxy]-N-(3-methoxy-benzyl)-isophthalamic acid; TFA::CHEMBL195720
SMILES COc1cccc(CNC(=O)c2ccc(Oc3nc(Oc4cccc(c4)C(N)=N)c(F)c(NC(C)CCc4ccccc4)c3F)c(c2)C(O)=O)c1
InChI Key InChIKey=WBHUHLVAUMTAGJ-UHFFFAOYSA-N
Data  2 IC50
  Tab Delimited (TSV)   2D SDfile   Computed 3D by Vconf -m prep SDfile
Find this compound or compounds like it in BindingDB:
Activity Spreadsheet -- Enzyme Inhibition Constant Data from BindingDB
Found 2 hits for monomerid = 50172214
TargetCoagulation factor VII/Tissue factor(Homo sapiens (Human))
Pfizer
Curated by ChEMBL
LigandPNGBDBM50172214(6-[6-(3-Carbamimidoyl-phenoxy)-3,5-difluoro-4-(1-m...)
Affinity DataIC50:  8nM. Assay description: Inhibitory concentration against human coagulation factor VIIa/tissue factor cleavage of fluorogenic substrate SN17c at 37 degree C for 15 minutes
In DepthDetails ArticlePubMed
TargetCoagulation factor X(Homo sapiens (Human))
Pfizer
Curated by ChEMBL
LigandPNGBDBM50172214(6-[6-(3-Carbamimidoyl-phenoxy)-3,5-difluoro-4-(1-m...)
Affinity DataIC50:  9.50E+3nM. Assay description: Inhibitory concentration against human coagulation factor Xa
In DepthDetails ArticlePubMed