BDBM50172782 1-(4-Chloro-phenyl)-3-(3-methylamino-propyl)-3,4-dihydro-1H-quinolin-2-one::CHEMBL197643
SMILES CNCCCC1Cc2ccccc2N(C1=O)c1ccc(Cl)cc1
InChI Key InChIKey=JZXQQBOUEFCSBP-UHFFFAOYSA-N
Data  3 KI
  Tab Delimited (TSV)   2D SDfile   Computed 3D by Vconf -m prep SDfile
Find this compound or compounds like it in BindingDB:
Activity Spreadsheet -- Enzyme Inhibition Constant Data from BindingDB
Found 3 hits for monomerid = 50172782
TargetSodium-dependent noradrenaline transporter(Homo sapiens (Human))
Eli Lilly
Curated by ChEMBL
LigandPNGBDBM50172782(1-(4-Chloro-phenyl)-3-(3-methylamino-propyl)-3,4-d...)
Affinity DataKi:  21nM. Assay description: Inhibition of monoamine reuptake at norepinephrine transporter
In DepthDetails ArticlePubMed
TargetSodium-dependent serotonin transporter(Homo sapiens (Human))
Eli Lilly
Curated by ChEMBL
LigandPNGBDBM50172782(1-(4-Chloro-phenyl)-3-(3-methylamino-propyl)-3,4-d...)
Affinity DataKi: >100nM. Assay description: Inhibitio of monoamine reuptake at serotonin transporter
In DepthDetails ArticlePubMed
TargetSodium-dependent dopamine transporter(Homo sapiens (Human))
Eli Lilly
Curated by ChEMBL
LigandPNGBDBM50172782(1-(4-Chloro-phenyl)-3-(3-methylamino-propyl)-3,4-d...)
Affinity DataKi: >200nM. Assay description: Inhibition of monoamine reuptake at dopamine transporter
In DepthDetails ArticlePubMed