BDBM50172802 CHEMBL383607::Sodium 8-hydroxy-8-(2-pentyloxy-quinolin-3-yl)-oct-5-ynoate (9a)::Sodium; 8-hydroxy-8-(2-pentyloxy-quinolin-3-yl)-oct-5-ynoate
SMILES CCCCCOc1nc2ccccc2cc1C(O)CC#CCCCC([O-])=O
InChI Key InChIKey=XYAOXOLKBMMGPK-UHFFFAOYSA-M
Data  2 KI  2 EC50
  Tab Delimited (TSV)   2D SDfile   Computed 3D by Vconf -m prep SDfile
Find this compound or compounds like it in BindingDB:
Activity Spreadsheet -- Enzyme Inhibition Constant Data from BindingDB
Found 4 hits for monomerid = 50172802
TargetPeroxisome proliferator-activated receptor gamma(Homo sapiens (Human))
Universit?? De Rennes 1
LigandPNGBDBM50172802(CHEMBL383607 | Sodium 8-hydroxy-8-(2-pentyloxy-qui...)
Affinity DataKi:  947nM ΔG°:  -7.63kcal/molepH: 8.2 T: 2°C. Assay description: Binding assays were performed in 96-well plate format, using a classical filtration assay with a human full length PPARγ construct (GST-PPAR LBD...
In DepthDetails ArticlePubMed
TargetPeroxisome proliferator-activated receptor gamma(Homo sapiens (Human))
Universit?? De Rennes 1
LigandPNGBDBM50172802(CHEMBL383607 | Sodium 8-hydroxy-8-(2-pentyloxy-qui...)
Affinity DataKi:  947nM. Assay description: Binding affinity for human PPAR gamma construct expressed in bacteria with 3[H] rosiglitazone
In DepthDetails ArticlePubMed
TargetPeroxisome proliferator-activated receptor gamma(Homo sapiens (Human))
Universit?? De Rennes 1
LigandPNGBDBM50172802(CHEMBL383607 | Sodium 8-hydroxy-8-(2-pentyloxy-qui...)
Affinity DataEC50:  617nM. Assay description: In vitro effective concentration against human peroxisome proliferator activated receptor gamma/Gal4 in cell-based transactivation assay
In DepthDetails ArticlePubMed
TargetPeroxisome proliferator-activated receptor alpha(Homo sapiens (Human))
Cnrs Umr 6052
Curated by ChEMBL
LigandPNGBDBM50172802(CHEMBL383607 | Sodium 8-hydroxy-8-(2-pentyloxy-qui...)
Affinity DataEC50:  114nM. Assay description: In vitro effective concentration against human peroxisome proliferator activated receptor alpha/Gal4 in transactivation assay
In DepthDetails ArticlePubMed