BDBM50172938 CHEMBL380652::N'-[(4-methylphenyl)sulfonyl]dibenzo[b,d]furan-2-carbohydrazide
SMILES Cc1ccc(cc1)S(=O)(=O)NNC(=O)c1ccc2oc3ccccc3c2c1
InChI Key InChIKey=ZOIXTRCEGYWYKU-UHFFFAOYSA-N
Data  1 IC50
  Tab Delimited (TSV)   2D SDfile   Computed 3D by Vconf -m prep SDfile
Find this compound or compounds like it in BindingDB:
Activity Spreadsheet -- Enzyme Inhibition Constant Data from BindingDB
Found 1 hit for monomerid = 50172938
TargetBranched-chain-amino-acid aminotransferase, cytosolic(Homo sapiens (Human))
Pfizer
Curated by ChEMBL
LigandPNGBDBM50172938(CHEMBL380652 | N'-[(4-methylphenyl)sulfonyl]dibenz...)
Affinity DataIC50:  5.10E+4nM. Assay description: Inhibition of human BCATc
In DepthDetails ArticlePubMed