BDBM50173135 CHEMBL3809641
SMILES Cc1noc(Cn2nc3ccc(cn3c2=O)-c2ccc(OC(F)(F)F)cc2)n1
InChI Key InChIKey=CIUYUJJQZDDGTM-UHFFFAOYSA-N
Data  9 IC50
  Tab Delimited (TSV)   2D SDfile   Computed 3D by Vconf -m prep SDfile
Find this compound or compounds like it in BindingDB:
Activity Spreadsheet -- Enzyme Inhibition Constant Data from BindingDB
Found 9 hits for monomerid = 50173135
TargetSodium channel protein type 5 subunit alpha(Homo sapiens (Human))
Gilead Sciences
Curated by ChEMBL
LigandPNGBDBM50173135(CHEMBL3809641)
Affinity DataIC50:  1.33E+3nM. Assay description: Inhibition of Nav1.5 (unknown origin) assessed as inhibition of late sodium current by manual patch clamp method
In DepthDetails ArticlePubMed
TargetSodium channel protein type 5 subunit alpha(Homo sapiens (Human))
Gilead Sciences
Curated by ChEMBL
LigandPNGBDBM50173135(CHEMBL3809641)
Affinity DataIC50: >1.00E+4nM. Assay description: Inhibition of 1 Hz stimulated Nav1.5 (unknown origin) assessed as inhibition of peak sodium current by manual patch clamp method
In DepthDetails ArticlePubMed
TargetSodium channel protein type 5 subunit alpha(Homo sapiens (Human))
Gilead Sciences
Curated by ChEMBL
LigandPNGBDBM50173135(CHEMBL3809641)
Affinity DataIC50: >1.00E+4nM. Assay description: Inhibition of 3 Hz stimulated Nav1.5 (unknown origin) assessed as inhibition of peak sodium current by manual patch clamp method
In DepthDetails ArticlePubMed
TargetSodium channel protein type 1 subunit alpha(Homo sapiens (Human))
Gilead Sciences
Curated by ChEMBL
LigandPNGBDBM50173135(CHEMBL3809641)
Affinity DataIC50: >1.00E+4nM. Assay description: Inhibition of 1 Hz stimulated Nav1.1 (unknown origin) by manual patch clamp method
In DepthDetails ArticlePubMed
TargetSodium channel protein type 2 subunit alpha(Homo sapiens (Human))
Gilead Sciences
Curated by ChEMBL
LigandPNGBDBM50173135(CHEMBL3809641)
Affinity DataIC50:  8.10E+3nM. Assay description: Inhibition of 10 Hz stimulated Nav1.2 (unknown origin) by manual patch clamp method
In DepthDetails ArticlePubMed
TargetSodium channel protein type 1 subunit alpha(Homo sapiens (Human))
Gilead Sciences
Curated by ChEMBL
LigandPNGBDBM50173135(CHEMBL3809641)
Affinity DataIC50:  4.80E+3nM. Assay description: Inhibition of 10 Hz stimulated Nav1.1 (unknown origin) by manual patch clamp method
In DepthDetails ArticlePubMed
TargetPotassium voltage-gated channel subfamily H member 2(Homo sapiens (Human))
Gilead Sciences
Curated by ChEMBL
LigandPNGBDBM50173135(CHEMBL3809641)
Affinity DataIC50: >1.00E+4nM. Assay description: Inhibition of human ERG
In DepthDetails ArticlePubMed
TargetSodium channel protein type 2 subunit alpha(Homo sapiens (Human))
Gilead Sciences
Curated by ChEMBL
LigandPNGBDBM50173135(CHEMBL3809641)
Affinity DataIC50:  4.20E+3nM. Assay description: Inhibition of 1 Hz stimulated Nav1.2 (unknown origin) by manual patch clamp method
In DepthDetails ArticlePubMed
TargetSodium channel protein type 5 subunit alpha(Homo sapiens (Human))
Gilead Sciences
Curated by ChEMBL
LigandPNGBDBM50173135(CHEMBL3809641)
Affinity DataIC50:  1.90E+3nM. Assay description: Inhibition of 0.1 Hz stimulated human Nav1.5alpha expressed in HEK293 cells assessed as inhibition of late sodium current with 3 compound additions f...
In DepthDetails ArticlePubMed