BDBM50173184 2-Furan-2-yl-6-pyrimidin-5-yl-[1,2,4]triazolo[1,5-a]pyrazin-8-ylamine::CHEMBL194589
SMILES Nc1nc(cn2nc(nc12)-c1ccco1)-c1cncnc1
InChI Key InChIKey=XYMBJXXAHCQYPI-UHFFFAOYSA-N
Data  1 KI
  Tab Delimited (TSV)   2D SDfile   Computed 3D by Vconf -m prep SDfile
Find this compound or compounds like it in BindingDB:
Activity Spreadsheet -- Enzyme Inhibition Constant Data from BindingDB
Found 1 hit for monomerid = 50173184
TargetAdenosine receptor A2a(Rattus norvegicus (rat))
Biogen Idec
Curated by ChEMBL
LigandPNGBDBM50173184(2-Furan-2-yl-6-pyrimidin-5-yl-[1,2,4]triazolo[1,5-...)
Affinity DataKi:  360nM. Assay description: Binding affinity towards adenosine A2a receptor of rat brain homogenates using [3H]-ZM-241,385 compared to SCH-58261 (Ki=37 nM)
In DepthDetails ArticlePubMed