BDBM50173302 CHEMBL3809055
SMILES FC(F)(F)Oc1ccc(cc1)-c1ccc2n[nH]c(=O)n2c1
InChI Key InChIKey=WCKSPUOMUKLNAH-UHFFFAOYSA-N
Data  1 IC50
  Tab Delimited (TSV)   2D SDfile   Computed 3D by Vconf -m prep SDfile
Find this compound or compounds like it in BindingDB:
Activity Spreadsheet -- Enzyme Inhibition Constant Data from BindingDB
Found 1 hit for monomerid = 50173302
TargetSodium channel protein type 5 subunit alpha(Homo sapiens (Human))
Gilead Sciences
Curated by ChEMBL
LigandPNGBDBM50173302(CHEMBL3809055)
Affinity DataIC50:  1.90E+3nM. Assay description: Inhibition of 0.1 Hz stimulated human Nav1.5alpha expressed in HEK293 cells assessed as inhibition of late sodium current with 3 compound additions f...
In DepthDetails ArticlePubMed