BDBM50173349 1-(4-tert-Butyl-phenyl)-6-chloro-3-(3-trifluoromethyl-phenoxy)-1H-indole-2-carboxylic acid::CHEMBL381865
SMILES CC(C)(C)c1ccc(cc1)-n1c(C(O)=O)c(Oc2cccc(c2)C(F)(F)F)c2ccc(Cl)cc12
InChI Key InChIKey=FOQAEWTVZXSVMU-UHFFFAOYSA-N
Data  2 IC50  1 EC50
  Tab Delimited (TSV)   2D SDfile   Computed 3D by Vconf -m prep SDfile
Find this compound or compounds like it in BindingDB:
Activity Spreadsheet -- Enzyme Inhibition Constant Data from BindingDB
Found 3 hits for monomerid = 50173349
TargetPeroxisome proliferator-activated receptor gamma(Homo sapiens (Human))
Merck Research Laboratories
Curated by ChEMBL
LigandPNGBDBM50173349(1-(4-tert-Butyl-phenyl)-6-chloro-3-(3-trifluoromet...)
Affinity DataIC50:  27nM. Assay description: Inhibitory concentration against human peroxisome proliferator activated receptor gamma in SPA assay
In DepthDetails ArticlePubMed
TargetPeroxisome proliferator-activated receptor gamma(Homo sapiens (Human))
Merck Research Laboratories
Curated by ChEMBL
LigandPNGBDBM50173349(1-(4-tert-Butyl-phenyl)-6-chloro-3-(3-trifluoromet...)
Affinity DataEC50:  106nM. Assay description: Effective agonist concentration for human PPAR gamma Gal4 construct in transactivation assay
In DepthDetails ArticlePubMed
TargetPeroxisome proliferator-activated receptor alpha(Homo sapiens (Human))
Merck Research Laboratories
Curated by ChEMBL
LigandPNGBDBM50173349(1-(4-tert-Butyl-phenyl)-6-chloro-3-(3-trifluoromet...)
Affinity DataIC50: >1.50E+4nM. Assay description: Inhibitory concentration against human peroxisome proliferator activated receptor alpha in SPA assay
In DepthDetails ArticlePubMed