BDBM50173436 3-{6-[(E)-2-((3R,3aS,4S,4aR,8aS,9aR)-3-Methyl-1-oxo-dodecahydro-naphtho[2,3-c]furan-4-yl)-vinyl]-pyridin-3-yl}-benzonitrile::CHEMBL439681
SMILES C[C@H]1OC(=O)[C@@H]2C[C@@H]3CCCC[C@H]3[C@H](\C=C\c3ccc(cn3)-c3cccc(c3)C#N)[C@H]12
InChI Key InChIKey=HKJJUDYGFHEZIG-XRFCILSCSA-N
Data  1 IC50
  Tab Delimited (TSV)   2D SDfile   Computed 3D by Vconf -m prep SDfile
Find this compound or compounds like it in BindingDB:
Activity Spreadsheet -- Enzyme Inhibition Constant Data from BindingDB
Found 1 hit for monomerid = 50173436
TargetProteinase-activated receptor 1(Homo sapiens (Human))
Schering-Plough Research Institute
Curated by ChEMBL
LigandPNGBDBM50173436(3-{6-[(E)-2-((3R,3aS,4S,4aR,8aS,9aR)-3-Methyl-1-ox...)
Affinity DataIC50:  25nM. Assay description: In vitro inhibitory concentration aganist human protease activated receptor 1 using [3H]-haTRAP as radioligand
In DepthDetails ArticlePubMed