BDBM50173474 CHEMBL197079::N-{(S)-2-(4-Amino-3,5-dibromo-phenyl)-1-[(R)-5-amino-1-(piperazine-1-carbonyl)-pentylcarbamoyl]-ethyl}-4-phenyl-butyramide
SMILES NCCCC[C@@H](NC(=O)[C@H](Cc1cc(Br)c(N)c(Br)c1)NC(=O)CCCc1ccccc1)C(=O)N1CCNCC1
InChI Key InChIKey=VMTBKIQIWKSGFP-RPBOFIJWSA-N
Data  1 IC50
  Tab Delimited (TSV)   2D SDfile   Computed 3D by Vconf -m prep SDfile
Find this compound or compounds like it in BindingDB:
Activity Spreadsheet -- Enzyme Inhibition Constant Data from BindingDB
Found 1 hit for monomerid = 50173474
TargetCalcitonin gene-related peptide type 1 receptor(Homo sapiens (Human))
Boehringer Ingelheim Pharma
Curated by ChEMBL
LigandPNGBDBM50173474(CHEMBL197079 | N-{(S)-2-(4-Amino-3,5-dibromo-pheny...)
Affinity DataIC50: >3.00E+5nMpH: 7.4Assay Description:Affinity against human calcitonin gene related peptide receptor (1 uM) expressed in SK-N-MC cells using [125I]-CGRP as radioligand after 180 minutes ...
In DepthDetails ArticlePubMed