BDBM50173536 1-{4-(tert-Butyl-dimethyl-silanyloxy)-5-[(trityl-amino)-methyl]-tetrahydro-furan-2-yl}-1H-pyrimidine-2,4-dione::CHEMBL196381
SMILES CC(C)(C)[Si](C)(C)OC1CC(OC1CNC(c1ccccc1)(c1ccccc1)c1ccccc1)n1ccc(=O)[nH]c1=O
InChI Key InChIKey=QTTFTVPTSUAFOG-UHFFFAOYSA-N
Data  3 KI
  Tab Delimited (TSV)   2D SDfile   Computed 3D by Vconf -m prep SDfile
Find this compound or compounds like it in BindingDB:
Activity Spreadsheet -- Enzyme Inhibition Constant Data from BindingDB
Found 3 hits for monomerid = 50173536
TargetDeoxyuridine 5'-triphosphate nucleotidohydrolase(Plasmodium falciparum)
Cardiff University
Curated by ChEMBL
LigandPNGBDBM50173536(1-{4-(tert-Butyl-dimethyl-silanyloxy)-5-[(trityl-a...)
Affinity DataKi:  3.13E+5nM. Assay description: Inhibitory constant against Plasmodium falciparum deoxyuridine 5'-triphosphate nucleotidohydrolase expressed in Escherichia coli BL21 (DE3) cells
In DepthDetails ArticlePubMed
TargetDeoxyuridine 5'-triphosphate nucleotidohydrolase, mitochondrial(Homo sapiens (Human))
Cardiff University
Curated by ChEMBL
LigandPNGBDBM50173536(1-{4-(tert-Butyl-dimethyl-silanyloxy)-5-[(trityl-a...)
Affinity DataKi: >1.00E+6nM. Assay description: Inhibitory constant against human deoxyuridine 5'-triphosphate nucleotidohydrolase expressed in Escherichia coli BL21 (DE3) cells
In DepthDetails ArticlePubMed
TargetPutative deoxyuridine triphosphatase(Leishmania major)
Cardiff University
Curated by ChEMBL
LigandPNGBDBM50173536(1-{4-(tert-Butyl-dimethyl-silanyloxy)-5-[(trityl-a...)
Affinity DataKi: >1.00E+6nM. Assay description: Inhibitory constant against Leishmania major deoxyuridine 5'-triphosphate nucleotidohydrolase
In DepthDetails ArticlePubMed