BDBM50173547 CHEMBL194845::N-[5-(2,4-Dioxo-3,4-dihydro-2H-pyrimidin-1-yl)-3-hydroxy-tetrahydro-furan-2-ylmethyl]-methanesulfonamide
SMILES CS(=O)(=O)NCC1OC(CC1O)n1ccc(=O)[nH]c1=O
InChI Key InChIKey=MDJUSGVWPPQCOJ-UHFFFAOYSA-N
Data  3 KI
  Tab Delimited (TSV)   2D SDfile   Computed 3D by Vconf -m prep SDfile
Find this compound or compounds like it in BindingDB:
Activity Spreadsheet -- Enzyme Inhibition Constant Data from BindingDB
Found 3 hits for monomerid = 50173547
TargetDeoxyuridine 5'-triphosphate nucleotidohydrolase(Plasmodium falciparum)
Cardiff University
Curated by ChEMBL
LigandPNGBDBM50173547(CHEMBL194845 | N-[5-(2,4-Dioxo-3,4-dihydro-2H-pyri...)
Affinity DataKi:  1.78E+5nM. Assay description: Inhibitory constant against Plasmodium falciparum deoxyuridine 5'-triphosphate nucleotidohydrolase expressed in Escherichia coli BL21 (DE3) cells
In DepthDetails ArticlePubMed
TargetPutative deoxyuridine triphosphatase(Leishmania major)
Cardiff University
Curated by ChEMBL
LigandPNGBDBM50173547(CHEMBL194845 | N-[5-(2,4-Dioxo-3,4-dihydro-2H-pyri...)
Affinity DataKi: >1.00E+6nM. Assay description: Inhibitory constant against Leishmania major deoxyuridine 5'-triphosphate nucleotidohydrolase
In DepthDetails ArticlePubMed
TargetDeoxyuridine 5'-triphosphate nucleotidohydrolase, mitochondrial(Homo sapiens (Human))
Cardiff University
Curated by ChEMBL
LigandPNGBDBM50173547(CHEMBL194845 | N-[5-(2,4-Dioxo-3,4-dihydro-2H-pyri...)
Affinity DataKi: >1.00E+6nM. Assay description: Inhibitory constant against human deoxyuridine 5'-triphosphate nucleotidohydrolase expressed in Escherichia coli BL21 (DE3) cells
In DepthDetails ArticlePubMed