BDBM50173576 1-[5-(Benzylamino-methyl)-4-hydroxy-tetrahydro-furan-2-yl]-1H-pyrimidine-2,4-dione::CHEMBL364710::dUTPase inhibitor, 11
SMILES OC1CC(OC1CNCc1ccccc1)n1ccc(=O)[nH]c1=O
InChI Key InChIKey=JFCBWRBGLGUNPH-UHFFFAOYSA-N
Data  6 KI
  Tab Delimited (TSV)   2D SDfile   Computed 3D by Vconf -m prep SDfile
Find this compound or compounds like it in BindingDB:
Activity Spreadsheet -- Enzyme Inhibition Constant Data from BindingDB
Found 6 hits for monomerid = 50173576
TargetDeoxyuridine 5'-triphosphate nucleotidohydrolase(Plasmodium falciparum)
Instituto De Parastiologia Y Biomedicina "Lopez-Neyra
LigandPNGBDBM50173576(1-[5-(Benzylamino-methyl)-4-hydroxy-tetrahydro-fur...)
Affinity DataKi:  1.11E+5nM ΔG°:  -5.39kcal/molepH: 8.0 T: 2°C. Assay description: Nucleotide hydrolysis was monitored by mixing enzyme and substrate with a rapid kinetic accessory (Hi-Tech Scientific) attached to a spectrophotomete...
In DepthDetails ArticlePubMed
TargetDeoxyuridine 5'-triphosphate nucleotidohydrolase(Plasmodium falciparum)
Instituto De Parastiologia Y Biomedicina "Lopez-Neyra
LigandPNGBDBM50173576(1-[5-(Benzylamino-methyl)-4-hydroxy-tetrahydro-fur...)
Affinity DataKi:  1.11E+5nM. Assay description: Inhibitory constant against Plasmodium falciparum deoxyuridine 5'-triphosphate nucleotidohydrolase expressed in Escherichia coli BL21 (DE3) cells
In DepthDetails ArticlePubMed
TargetPutative deoxyuridine triphosphatase(Leishmania major)
Cardiff University
Curated by ChEMBL
LigandPNGBDBM50173576(1-[5-(Benzylamino-methyl)-4-hydroxy-tetrahydro-fur...)
Affinity DataKi: >1.00E+6nM. Assay description: Inhibitory constant against Leishmania major deoxyuridine 5'-triphosphate nucleotidohydrolase
In DepthDetails ArticlePubMed
TargetDeoxyuridine 5'-triphosphate nucleotidohydrolase, mitochondrial(Homo sapiens (Human))
Cardiff University
Curated by ChEMBL
LigandPNGBDBM50173576(1-[5-(Benzylamino-methyl)-4-hydroxy-tetrahydro-fur...)
Affinity DataKi: >1.00E+6nM. Assay description: Inhibitory constant against human deoxyuridine 5'-triphosphate nucleotidohydrolase expressed in Escherichia coli BL21 (DE3) cells
In DepthDetails ArticlePubMed
TargetDeoxyuridine 5'-triphosphate nucleotidohydrolase, mitochondrial(Homo sapiens (Human))
Cardiff University
Curated by ChEMBL
LigandPNGBDBM50173576(1-[5-(Benzylamino-methyl)-4-hydroxy-tetrahydro-fur...)
Affinity DataKi:  1.00E+6nM ΔG°:  -4.09kcal/molepH: 8.0 T: 2°C. Assay description: Nucleotide hydrolysis was monitored by mixing enzyme and substrate with a rapid kinetic accessory (Hi-Tech Scientific) attached to a spectrophotomete...
In DepthDetails ArticlePubMed
TargetdCTP deaminase(Campylobacter jejuni)
Instituto De Parastiologia Y Biomedicina "Lopez-Neyra
LigandPNGBDBM50173576(1-[5-(Benzylamino-methyl)-4-hydroxy-tetrahydro-fur...)
Affinity DataKi:  1.00E+9nM ΔG°:  0kcal/molepH: 8.0 T: 2°C. Assay description: Nucleotide hydrolysis was monitored by mixing enzyme and substrate with a rapid kinetic accessory (Hi-Tech Scientific) attached to a spectrophotomete...
In DepthDetails ArticlePubMed