BDBM50173759 2-(4'-chlorobiphenyl-3-yl)-1-hydroxyethane-1,1-diyldiphosphonic acid::CHEMBL194213::[2-(4'-Chloro-biphenyl-3-yl)-1-hydroxy-1-phosphono-ethyl]-phosphonic acid
SMILES OC(Cc1cccc(c1)-c1ccc(Cl)cc1)(P(O)(O)=O)P(O)(O)=O
InChI Key InChIKey=RVCVZAQVHMLXKI-UHFFFAOYSA-N
Data  1 IC50
  Tab Delimited (TSV)   2D SDfile   Computed 3D by Vconf -m prep SDfile
Find this compound or compounds like it in BindingDB:
Activity Spreadsheet -- Enzyme Inhibition Constant Data from BindingDB
Found 1 hit for monomerid = 50173759
TargetH(+)-exporting diphosphatase(Trypanosoma brucei)
University Of Illinois At Urbana-Champaign
Curated by ChEMBL
LigandPNGBDBM50173759(2-(4'-chlorobiphenyl-3-yl)-1-hydroxyethane-1,1-diy...)
Affinity DataIC50:  3.67E+5nM. Assay description: Inhibition of recombinant Trypanosoma brucei soluble vacuolar pyrophosphatase expressed in Escherichia coli
In DepthDetails ArticlePubMed