BDBM50173882 CHEMBL3809242
SMILES CCn1c2[nH]nc(-c3cnc(s3)-c3cccnc3)c2cc(C)c1=O
InChI Key InChIKey=AKEXXQMWWDULIU-UHFFFAOYSA-N
Data  1 IC50
  Tab Delimited (TSV)   2D SDfile   Computed 3D by Vconf -m prep SDfile
Find this compound or compounds like it in BindingDB:
Activity Spreadsheet -- Enzyme Inhibition Constant Data from BindingDB
Found 1 hit for monomerid = 50173882
TargetDNA gyrase subunit B(Staphylococcus aureus)
Cubist Pharmaceuticals
Curated by ChEMBL
LigandPNGBDBM50173882(CHEMBL3809242)
Affinity DataIC50:  35nM. Assay description: Inhibition of Staphylococcus aureus DNA gyraseB ATPase activity using linear pBR322 DNA substrate incubated for 30 mins by fluorescence polarization ...
In DepthDetails ArticlePubMed